BDBM50387592 CHEMBL2057729::US8633204, 212
SMILES COc1ccc(cn1)-c1cc2c(C)nc(N)nc2n(C2CC2)c1=O
InChI Key InChIKey=ZJHXTZUQHWPNKV-UHFFFAOYSA-N
Data  1 KI  1 IC50
  Tab Delimited (TSV)   2D SDfile   Computed 3D by Vconf -m prep SDfile
Find this compound or compounds like it in BindingDB:
Activity Spreadsheet -- Enzyme Inhibition Constant Data from BindingDB
Found 2 hits for monomerid = 50387592
LigandPNGBDBM50387592(CHEMBL2057729 | US8633204, 212)
Affinity DataKi:  26nM. Assay description: Inhibition of mouse PI3Kalpha
In DepthDetails ArticlePubMed
LigandPNGBDBM50387592(CHEMBL2057729 | US8633204, 212)
Affinity DataIC50:  56nMpH: 7.4 T: 2°C. Assay description: Compounds of the present invention were evaluated for potency against PI3-Kα using an in vitro kinase assay. PI3-Kα activity is measured in...
In DepthDetails US Patent