BDBM50387677 CHEMBL2058078
SMILES CCn1c(CNc2ccccc2)nnc1SCC(=O)Nc1ccc(cc1)C(=O)OC
InChI Key InChIKey=WSHWKOZXXYBYCF-UHFFFAOYSA-N
Data  1 IC50
  Tab Delimited (TSV)   2D SDfile   Computed 3D by Vconf -m prep SDfile
Find this compound or compounds like it in BindingDB:
Activity Spreadsheet -- Enzyme Inhibition Constant Data from BindingDB
Found 1 hit for monomerid = 50387677
TargetLong-chain fatty acid transport protein 1(Homo sapiens (Human))
Daiichi Sankyo
Curated by ChEMBL
LigandPNGBDBM50387677(CHEMBL2058078)
Affinity DataIC50:  540nM. Assay description: Inhibition of human recombinant FATP1 acyl-coA synthetase activity using [14C]oleic acid as substrate
In DepthDetails ArticlePubMed