BDBM50387787 CHEMBL2057502
SMILES Cc1noc(C)c1S(=O)(=O)N1CC(C1)C(=O)N1CCN(CC1)c1ccncc1
InChI Key InChIKey=NVENFANZEHYQEH-UHFFFAOYSA-N
Data  2 IC50
  Tab Delimited (TSV)   2D SDfile   Computed 3D by Vconf -m prep SDfile
Find this compound or compounds like it in BindingDB:
Activity Spreadsheet -- Enzyme Inhibition Constant Data from BindingDB
Found 2 hits for monomerid = 50387787
TargetMuscarinic acetylcholine receptor M1(Homo sapiens (Human))
Vanderbilt University Medical Center
Curated by ChEMBL
LigandPNGBDBM50387787(CHEMBL2057502)
Affinity DataIC50:  2.29E+3nM. Assay description: Antagonist activity at human muscarinic M1 receptor expressed in CHO cells assessed as inhibition of acetylcholine-induced calcium mobilization by fl...
In DepthDetails ArticlePubMed
TargetMuscarinic acetylcholine receptor M1(Homo sapiens (Human))
Vanderbilt University Medical Center
Curated by ChEMBL
LigandPNGBDBM50387787(CHEMBL2057502)
Affinity DataIC50:  2.30E+3nM. Assay description: Antagonist activity at human muscarinic M1 receptor expressed in CHO cells assessed as inhibition of acetylcholine-induced calcium mobilization by fl...
In DepthDetails ArticlePubMed