BDBM50387921 CHEMBL2058684::US9283222, 606
SMILES Fc1ccc(Cc2n[nH]c(=O)c3CCCNc23)cc1N1C(=O)CCNC1=O
InChI Key InChIKey=UMDKWDOGTIIRNG-UHFFFAOYSA-N
Data  2 KI
  Tab Delimited (TSV)   2D SDfile   Computed 3D by Vconf -m prep SDfile
Find this compound or compounds like it in BindingDB:
Activity Spreadsheet -- Enzyme Inhibition Constant Data from BindingDB
Found 2 hits for monomerid = 50387921
TargetPoly [ADP-ribose] polymerase 1(Homo sapiens (Human))
Abbott Laboratories
Curated by ChEMBL
LigandPNGBDBM50387921(CHEMBL2058684 | US9283222, 606)
Affinity DataKi:  17nM. Assay description: Inhibition of PARP1 using [3H]NAD+ after 1 hr by scintillation counting
In DepthDetails ArticlePubMed
TargetPoly [ADP-ribose] polymerase 1(Homo sapiens (Human))
Abbott Laboratories
Curated by ChEMBL
LigandPNGBDBM50387921(CHEMBL2058684 | US9283222, 606)
Affinity DataKi:  17nMpH: 8.0Assay Description:PARP1 assay was conducted in PARP assay buffer containing 50 mM Tris pH 8.0, 1 mM DTT, 4 mM MgCl2. PARP reactions contained 1.5 uM [3H]-NAD+ (1.6 uCi...
In DepthDetails US Patent