BDBM50388021 CHEMBL2058412
SMILES CN1C(N)=NC(=Cc2c[nH]c3ccc(Br)cc23)C1=O
InChI Key InChIKey=GNSVRFWTXROQNX-UHFFFAOYSA-N
Data  2 IC50
  Tab Delimited (TSV)   2D SDfile   Computed 3D by Vconf -m prep SDfile
Find this compound or compounds like it in BindingDB:
Activity Spreadsheet -- Enzyme Inhibition Constant Data from BindingDB
Found 2 hits for monomerid = 50388021
TargetAmine oxidase [flavin-containing] A(Homo sapiens (Human))
University Of Mississippi
Curated by ChEMBL
LigandPNGBDBM50388021(CHEMBL2058412)
Affinity DataIC50:  327nM. Assay description: Inhibition of human recombinant MAO-A using kynuramine as substrate preincubated with compound for 15 mins measured after 20 mins by fluorometric ana...
In DepthDetails ArticlePubMed
TargetAmine oxidase [flavin-containing] B(Homo sapiens (Human))
University Of Mississippi
Curated by ChEMBL
LigandPNGBDBM50388021(CHEMBL2058412)
Affinity DataIC50:  4.30E+3nM. Assay description: Inhibition of human recombinant MAO-B using kynuramine as substrate preincubated with compound for 15 mins measured after 20 mins by fluorometric ana...
In DepthDetails ArticlePubMed