BDBM50388084 CHEMBL2057856
SMILES CCCCCCCCCNC(=O)C(C)c1ccc(O)c(OC)c1
InChI Key InChIKey=IJNAZFGZTNRXLO-UHFFFAOYSA-N
Data  1 KI  1 EC50
  Tab Delimited (TSV)   2D SDfile   Computed 3D by Vconf -m prep SDfile
Find this compound or compounds like it in BindingDB:
Activity Spreadsheet -- Enzyme Inhibition Constant Data from BindingDB
Found 2 hits for monomerid = 50388084
TargetTransient receptor potential cation channel subfamily V member 1(Rattus norvegicus (rat))
Seoul National University
Curated by ChEMBL
LigandPNGBDBM50388084(CHEMBL2057856)
Affinity DataKi:  159nM. Assay description: Displacement of [3H]RTX from rat TRPV1 expressed in CHO cells
In DepthDetails ArticlePubMed
TargetTransient receptor potential cation channel subfamily V member 1(Rattus norvegicus (rat))
Seoul National University
Curated by ChEMBL
LigandPNGBDBM50388084(CHEMBL2057856)
Affinity DataEC50:  26.3nM. Assay description: Agonist activity at rat TRPV1 expressed in CHO cells assessed as calcium uptake
In DepthDetails ArticlePubMed