BDBM50388272 CHEMBL2058223
SMILES COc1ccc(CC[C@@H](OC(=O)[C@@H]2CCCCN2S(=O)(=O)c2cccc(Cl)c2)c2cccc(OCC(O)=O)c2)cc1OC
InChI Key InChIKey=NRQDADMALYCZRS-RRPNLBNLSA-N
Data  3 IC50
  Tab Delimited (TSV)   2D SDfile   Computed 3D by Vconf -m prep SDfile
Find this compound or compounds like it in BindingDB:
Activity Spreadsheet -- Enzyme Inhibition Constant Data from BindingDB
Found 3 hits for monomerid = 50388272
TargetPeptidyl-prolyl cis-trans isomerase FKBP5(Homo sapiens (Human))
Max Planck Institute Of Psychiatry
Curated by ChEMBL
LigandPNGBDBM50388272(CHEMBL2058223)
Affinity DataIC50:  3.07E+4nM. Assay description: Binding affinity to FKBP51 FK1 domain by competitive fluorescence polarization assay
In DepthDetails ArticlePubMed
TargetPeptidyl-prolyl cis-trans isomerase FKBP1A(Homo sapiens (Human))
Max Planck Institute Of Psychiatry
Curated by ChEMBL
LigandPNGBDBM50388272(CHEMBL2058223)
Affinity DataIC50:  1.20E+3nM. Assay description: Binding affinity to FKBP12 by competitive fluorescence polarization assay
In DepthDetails ArticlePubMed
TargetPeptidyl-prolyl cis-trans isomerase FKBP4(Homo sapiens (Human))
Max Planck Institute Of Psychiatry
Curated by ChEMBL
LigandPNGBDBM50388272(CHEMBL2058223)
Affinity DataIC50:  3.28E+4nM. Assay description: Binding affinity to FKBP52 FK1 domain by competitive fluorescence polarization assay
In DepthDetails ArticlePubMed