BDBM50388375 CHEMBL2057636
SMILES COc1cccc([C@H]2O[C@H](CCn3cc(nn3)C(O)=O)c3cccn3-c3ccc(Cl)cc23)c1OC
InChI Key InChIKey=XGSGCOCEMJCJIW-FYYLOGMGSA-N
Data  1 IC50
  Tab Delimited (TSV)   2D SDfile   Computed 3D by Vconf -m prep SDfile
Find this compound or compounds like it in BindingDB:
Activity Spreadsheet -- Enzyme Inhibition Constant Data from BindingDB
Found 1 hit for monomerid = 50388375
TargetSqualene synthase(Rattus norvegicus)
Daiichi Sankyo
Curated by ChEMBL
LigandPNGBDBM50388375(CHEMBL2057636)
Affinity DataIC50:  0.590nM. Assay description: Inhibition of squalene synthase in rat hepatic cells
In DepthDetails ArticlePubMed