BDBM50388415 CHEMBL2059050
SMILES CC(C)N(C)C(=O)c1nc(-c2ccc(Cl)cc2)c2ccccc2n1
InChI Key InChIKey=AZJASHCESXNMHV-UHFFFAOYSA-N
Data  1 KI
  Tab Delimited (TSV)   2D SDfile   Computed 3D by Vconf -m prep SDfile
Find this compound or compounds like it in BindingDB:
Activity Spreadsheet -- Enzyme Inhibition Constant Data from BindingDB
Found 1 hit for monomerid = 50388415
TargetTranslocator protein(Rattus norvegicus (rat))
Universit£
Curated by ChEMBL
LigandPNGBDBM50388415(CHEMBL2059050)
Affinity DataKi:  50.4nM. Assay description: Displacement of [3H]PK11195 from TSPO in rat kidney mitochondrial membranes by competitive binding assay
In DepthDetails ArticlePubMed