BDBM50388829 CHEMBL2062753
SMILES CN(C)CCCOc1ccc(\C=C2/SC(=S)N(CC=C)C2=O)cc1
InChI Key InChIKey=XSXKOIMDNZRKRL-SSZFMOIBSA-N
Data  1 IC50
  Tab Delimited (TSV)   2D SDfile   Computed 3D by Vconf -m prep SDfile
Find this compound or compounds like it in BindingDB:
Activity Spreadsheet -- Enzyme Inhibition Constant Data from BindingDB
Found 1 hit for monomerid = 50388829
TargetDynamin-1(Homo sapiens (Human))
TBA
Curated by ChEMBL
LigandPNGBDBM50388829(CHEMBL2062753)
Affinity DataIC50:  5.90E+3nM. Assay description: Inhibition of dynamin1-mediated endocytosis in human U2OS cells assessed as inhibition of Texas red-Tf uptake incubated for 30 mins prior to Texas re...
In DepthDetails ArticlePubMed