BDBM50388972 CHEMBL2063865
SMILES CC(C)[C@H](NC(=O)[C@H](C)NC[C@H](O)CO)C(=O)N1CCC[C@H]1C(=O)NCC(c1ccccc1)c1ccccc1
InChI Key InChIKey=CULLTURVHZXDJG-OIMINJBOSA-N
Data  2 KI
  Tab Delimited (TSV)   2D SDfile   Computed 3D by Vconf -m prep SDfile
Find this compound or compounds like it in BindingDB:
Activity Spreadsheet -- Enzyme Inhibition Constant Data from BindingDB
Found 2 hits for monomerid = 50388972
TargetMax-like protein X(Homo sapiens (Human))
Genentech
Curated by ChEMBL
LigandPNGBDBM50388972(CHEMBL2063865)
Affinity DataKi:  80nM. Assay description: Displacement of 5-FAM-conjugated AVP-diPhe-FAM from MLXBIR3SG after 30 mins by fluorescence polarization-based competition assay
In DepthDetails ArticlePubMed
TargetE3 ubiquitin-protein ligase XIAP(Homo sapiens (Human))
Genentech
Curated by ChEMBL
LigandPNGBDBM50388972(CHEMBL2063865)
Affinity DataKi:  800nM. Assay description: Displacement of 5-FAM-conjugated AVP-diPhe-FAM from XIAP BIR3 domain after 30 mins by fluorescence polarization-based competition assay
In DepthDetails ArticlePubMed