BDBM50388996 CHEMBL2063898
SMILES CC(C)C[C@H](NC(=O)CNC(=O)[C@H](CC(C)C)NC(=O)[C@H](CCCCN)NC(=O)[C@H](CO)NC(=O)[C@H](C)NC(=O)[C@H](CCCN=C(N)N)NC(=O)[C@H](Cc1c[nH]c2ccccc12)NC(=O)[C@H](CCCN=C(N)N)NC(=O)[C@H](CCCN=C(N)N)NC(=O)[C@@H](NC(=O)[C@H](Cc1c[nH]c2ccccc12)NC(=O)[C@H](Cc1c[nH]c2ccccc12)NC(C)=O)[C@@H](C)O)C(=O)N[C@@H](C)C(=O)N[C@@H](CCCN=C(N)N)C(O)=O
InChI Key InChIKey=UTFPQSAMSOOBEW-KZXIJLKPSA-N
Data  1 IC50  1 EC50
  Tab Delimited (TSV)   2D SDfile   Computed 3D by Vconf -m prep SDfile
Find this compound or compounds like it in BindingDB:
Activity Spreadsheet -- Enzyme Inhibition Constant Data from BindingDB
Found 2 hits for monomerid = 50388996
TargetC3a anaphylatoxin chemotactic receptor(Homo sapiens (Human))
Princeton University
Curated by ChEMBL
LigandPNGBDBM50388996(CHEMBL2063898)
Affinity DataIC50:  50.1nM. Assay description: Antagonist activity at human C3a receptor expressed in RBL-2H3 cells assessed as beta-hexosaminidase activity in cell supernatant compound preincubat...
In DepthDetails ArticlePubMed
TargetC3a anaphylatoxin chemotactic receptor(Homo sapiens (Human))
Princeton University
Curated by ChEMBL
LigandPNGBDBM50388996(CHEMBL2063898)
Affinity DataEC50:  195nM. Assay description: Agonist activity at human C3a receptor expressed in RBL-2H3 cells assessed as beta-hexosaminidase activity in cell supernatant by degranulation assay
In DepthDetails ArticlePubMed