BDBM50389056 CHEMBL2064409
SMILES Cc1cccc2nc(Cc3nc(cc(=O)[nH]3)N3CCOCC3)oc12
InChI Key InChIKey=ZCXQHOPHHNFUNN-UHFFFAOYSA-N
Data  6 IC50
  Tab Delimited (TSV)   2D SDfile   Computed 3D by Vconf -m prep SDfile
Find this compound or compounds like it in BindingDB:
Activity Spreadsheet -- Enzyme Inhibition Constant Data from BindingDB
Found 6 hits for monomerid = 50389056
TargetPhosphatidylinositol 4,5-bisphosphate 3-kinase catalytic subunit beta isoform(Homo sapiens (Human))
Sanofi Research & Development
Curated by ChEMBL
LigandPNGBDBM50389056(CHEMBL2064409)
Affinity DataIC50:  425nM. Assay description: Inhibition of N-terminus poly-His tagged human PI3Kbeta expressed in baculovirus infected insect S21 cells coexpressing p85alpha using PI(4,5)P2 as s...
In DepthDetails ArticlePubMed
TargetPhosphatidylinositol 4,5-bisphosphate 3-kinase catalytic subunit alpha isoform(Homo sapiens (Human))
Sanofi Research & Development
Curated by ChEMBL
LigandPNGBDBM50389056(CHEMBL2064409)
Affinity DataIC50:  7.15E+3nM. Assay description: Inhibition of N-terminus poly-His tagged human PI3Kalpha expressed in baculovirus infected insect sf9 cells coexpressing p85alpha using PI(4,5)P2 as ...
In DepthDetails ArticlePubMed
TargetPhosphatidylinositol 4,5-bisphosphate 3-kinase catalytic subunit delta isoform(Homo sapiens (Human))
Sanofi Research & Development
Curated by ChEMBL
LigandPNGBDBM50389056(CHEMBL2064409)
Affinity DataIC50:  2.39E+3nM. Assay description: Inhibition of poly-His tagged human PI3Kdelta expressed in baculovirus infected insect sf9 cells coexpressing p85alpha using PI(4,5)P2 as substrate p...
In DepthDetails ArticlePubMed
TargetSerine/threonine-protein kinase mTOR(Homo sapiens (Human))
Sanofi Research & Development
Curated by ChEMBL
LigandPNGBDBM50389056(CHEMBL2064409)
Affinity DataIC50: >1.00E+4nM. Assay description: Inhibition of mTOR
In DepthDetails ArticlePubMed
TargetPhosphatidylinositol 4,5-bisphosphate 3-kinase catalytic subunit gamma isoform(Homo sapiens (Human))
Sanofi Research & Development
Curated by ChEMBL
LigandPNGBDBM50389056(CHEMBL2064409)
Affinity DataIC50: >1.00E+4nM. Assay description: Inhibition of N-terminus poly-His tagged human PI3Kgamma expressed in baculovirus infected insect sf9 cells using PI(4,5)P2 as substrate preincubated...
In DepthDetails ArticlePubMed
TargetPhosphatidylinositol 4,5-bisphosphate 3-kinase catalytic subunit beta isoform(Homo sapiens (Human))
Sanofi Research & Development
Curated by ChEMBL
LigandPNGBDBM50389056(CHEMBL2064409)
Affinity DataIC50:  202nM. Assay description: Inhibition of human PI3Kbeta-mediated Akt phosphorylation at Ser473 residue expressed in PTEN-deficient human PC3 cells by chemiluminescence assay
In DepthDetails ArticlePubMed