BDBM50389174 CHEMBL2062777
SMILES CC1(C)C(C#N)C(=N)OC2=C1C(=O)CC(C2)c1ccccc1
InChI Key InChIKey=MCKJBYFMAHTKBM-UHFFFAOYSA-N
Data  1 IC50
  Tab Delimited (TSV)   2D SDfile   Computed 3D by Vconf -m prep SDfile
Find this compound or compounds like it in BindingDB:
Activity Spreadsheet -- Enzyme Inhibition Constant Data from BindingDB
Found 1 hit for monomerid = 50389174
TargetExcitatory amino acid transporter 1(Homo sapiens (Human))
University Of Copenhagen
Curated by ChEMBL
LigandPNGBDBM50389174(CHEMBL2062777)
Affinity DataIC50: >3.00E+5nM. Assay description: Inhibition of human EAAT1 expressed in HEK293 cells assessed as inhibition of 3[H]-D-Aspartate uptake after 6 mins by scintillation counting method
In DepthDetails ArticlePubMed