BDBM50389204 CHEMBL2062977
SMILES [#7]\[#6](-[#7])=[#7]\[#6]-[#6]-[#6]-[#6@@H]-1-[#7]-[#6](=O)-[#6@H]-2-[#6]-[#8]-[#6]-[#6]-[#7]-2-[#6](=O)-[#6@@H](-[#6]-c2ccc(-[#8])c(I)c2)-[#7]-[#6](=O)-[#6@H](-[#6]-[#6](-[#8])=O)-[#7]-[#6](=O)-[#6]-[#7]-[#6]-1=O
InChI Key InChIKey=LPOXWPIIMACJCX-WNRNVDISSA-N
Data  1 IC50
  Tab Delimited (TSV)   2D SDfile   Computed 3D by Vconf -m prep SDfile
Find this compound or compounds like it in BindingDB:
Activity Spreadsheet -- Enzyme Inhibition Constant Data from BindingDB
Found 1 hit for monomerid = 50389204
TargetIntegrin alpha-V/beta-3(Homo sapiens (Human))
University Of Florence
Curated by ChEMBL
LigandPNGBDBM50389204(CHEMBL2062977)
Affinity DataIC50:  48nM. Assay description: Displacement of [125I] echistatin from alphaVbeta3 integrin isolated from human placenta after 3 hrs by liquid scintillation counter
In DepthDetails ArticlePubMed