BDBM50389333 CHEMBL2064061
SMILES CC1(C)Oc2cc(cc(O)c2[C@@H]2C[C@H](O)CC[C@@H]12)C(=O)c1cscn1
InChI Key InChIKey=UHBWTJMNRPXUDI-JHJVBQTASA-N
Data  3 KI
  Tab Delimited (TSV)   2D SDfile   Computed 3D by Vconf -m prep SDfile
Find this compound or compounds like it in BindingDB:
Activity Spreadsheet -- Enzyme Inhibition Constant Data from BindingDB
Found 3 hits for monomerid = 50389333
TargetCannabinoid receptor 1(Rattus norvegicus (rat))
University Of Hawaii At Manoa
Curated by ChEMBL
LigandPNGBDBM50389333(CHEMBL2064061)
Affinity DataKi: >1.00E+3nM. Assay description: Displacement of [3H]CP-55,940 from rat brain CB1 receptor
In DepthDetails ArticlePubMed
TargetCannabinoid receptor 2(MOUSE)
University Of Hawaii At Manoa
Curated by ChEMBL
LigandPNGBDBM50389333(CHEMBL2064061)
Affinity DataKi: >1.00E+3nM. Assay description: Displacement of [3H]CP-55,940 from mouse CB2 receptor expressed in HEK293 cells
In DepthDetails ArticlePubMed
TargetCannabinoid receptor 2(Homo sapiens (Human))
University Of Hawaii At Manoa
Curated by ChEMBL
LigandPNGBDBM50389333(CHEMBL2064061)
Affinity DataKi: >1.00E+3nM. Assay description: Displacement of [3H]CP-55,940 from human CB2 receptor expressed in HEK293 cells
In DepthDetails ArticlePubMed