BDBM50389398 CHEMBL2064486
SMILES CNC(=O)c1cccc(c1)-c1ccc2nc(NC(C)=O)nn2c1
InChI Key InChIKey=YMSXIPTVYHZKHX-UHFFFAOYSA-N
Data  3 IC50
  Tab Delimited (TSV)   2D SDfile   Computed 3D by Vconf -m prep SDfile
Find this compound or compounds like it in BindingDB:
Activity Spreadsheet -- Enzyme Inhibition Constant Data from BindingDB
Found 3 hits for monomerid = 50389398
LigandPNGBDBM50389398(CHEMBL2064486)
Affinity DataIC50:  631nM. Assay description: Inhibition of PI3Kgamma by high throughput chemoproteomics binding assay
In DepthDetails ArticlePubMed
LigandPNGBDBM50389398(CHEMBL2064486)
Affinity DataIC50: >5.01E+4nM. Assay description: Inhibition of PI3Kalpha by high throughput chemoproteomics binding assay
In DepthDetails ArticlePubMed
LigandPNGBDBM50389398(CHEMBL2064486)
Affinity DataIC50: >1.00E+5nM. Assay description: Inhibition of PI3Kdelta by high throughput chemoproteomics binding assay
In DepthDetails ArticlePubMed