BDBM50389399 CHEMBL2064487
SMILES CC(=O)Nc1nc2ccc(cn2n1)-c1ccc(cc1)S(C)(=O)=O
InChI Key InChIKey=IGMBGRYLKYZMTI-UHFFFAOYSA-N
Data  3 IC50
  Tab Delimited (TSV)   2D SDfile   Computed 3D by Vconf -m prep SDfile
Find this compound or compounds like it in BindingDB:
Activity Spreadsheet -- Enzyme Inhibition Constant Data from BindingDB
Found 3 hits for monomerid = 50389399
LigandPNGBDBM50389399(CHEMBL2064487)
Affinity DataIC50: >1.00E+5nM. Assay description: Inhibition of PI3Kgamma by high throughput chemoproteomics binding assay
In DepthDetails ArticlePubMed
LigandPNGBDBM50389399(CHEMBL2064487)
Affinity DataIC50: >1.00E+5nM. Assay description: Inhibition of PI3Kdelta by high throughput chemoproteomics binding assay
In DepthDetails ArticlePubMed
LigandPNGBDBM50389399(CHEMBL2064487)
Affinity DataIC50: >1.00E+5nM. Assay description: Inhibition of PI3Kalpha by high throughput chemoproteomics binding assay
In DepthDetails ArticlePubMed