BDBM50389830 CHEMBL1714515
SMILES O=C(CCN1C(=O)c2ccccc2C1=O)Nc1nc2ccccc2s1
InChI Key InChIKey=ULXHINOEZKZYNA-UHFFFAOYSA-N
Data  1 KI
  Tab Delimited (TSV)   2D SDfile   Computed 3D by Vconf -m prep SDfile
Find this compound or compounds like it in BindingDB:
Activity Spreadsheet -- Enzyme Inhibition Constant Data from BindingDB
Found 1 hit for monomerid = 50389830
TargetAdenosine receptor A2a(Homo sapiens (Human))
Radboud University Nijmegen Medical Centre
Curated by ChEMBL
LigandPNGBDBM50389830(CHEMBL1714515)
Affinity DataKi:  5.01E+3nM. Assay description: Displacement of [3H]ZM241385 from human AA2AR expressed in HEK293T cells after 2 hrs by liquid scintillation counter
In DepthDetails ArticlePubMed