BDBM50390013 CHEMBL2071529
SMILES COc1cc(NS(=O)(=O)c2ccc(NC(=O)Nc3cccc(Cl)c3)cc2)nc(OC)n1
InChI Key InChIKey=BKBZRXSPMLJDFI-UHFFFAOYSA-N
Data  1 KI
  Tab Delimited (TSV)   2D SDfile   Computed 3D by Vconf -m prep SDfile
Find this compound or compounds like it in BindingDB:
Activity Spreadsheet -- Enzyme Inhibition Constant Data from BindingDB
Found 1 hit for monomerid = 50390013
TargetP2Y purinoceptor 1(Homo sapiens (Human))
National Institutes Of Health
Curated by ChEMBL
LigandPNGBDBM50390013(CHEMBL2071529)
Affinity DataKi:  6.00E+3nM. Assay description: Displacement of [125I]MRS2500 from human P2Y1R expressed in Sf9 cell membrane
In DepthDetails ArticlePubMed