BDBM50390320 CHEMBL2070600
SMILES Nc1nc(nc2n(C[C@H]3CCCO3)nnc12)C1CC1
InChI Key InChIKey=ORCRTACJUZWWSJ-MRVPVSSYSA-N
Data  1 IC50
  Tab Delimited (TSV)   2D SDfile   Computed 3D by Vconf -m prep SDfile
Find this compound or compounds like it in BindingDB:
Activity Spreadsheet -- Enzyme Inhibition Constant Data from BindingDB
Found 1 hit for monomerid = 50390320
LigandPNGBDBM50390320(CHEMBL2070600)
Affinity DataIC50:  25nM. Assay description: Inhibition of PDE8B expressed in Sf9 insect cells
In DepthDetails ArticlePubMed