BDBM50390398 CHEMBL2070949
SMILES O=C(NC1(CC1)C#N)[C@@H]1CCCC[C@H]1C(=O)N1CCN(CC1)c1nc2cccnc2s1
InChI Key InChIKey=WIKIUJMLESFHCO-HZPDHXFCSA-N
Data  10 IC50
  Tab Delimited (TSV)   2D SDfile   Computed 3D by Vconf -m prep SDfile
Find this compound or compounds like it in BindingDB:
Activity Spreadsheet -- Enzyme Inhibition Constant Data from BindingDB
Found 10 hits for monomerid = 50390398
TargetCathepsin K(Homo sapiens (Human))
Astrazeneca
Curated by ChEMBL
LigandPNGBDBM50390398(CHEMBL2070949)
Affinity DataIC50:  316nM. Assay description: Inhibition of human recombinant cathepsin K using Z-Phe-Arg-AMC as substrate preincubated for 30 mins measured after 1 hr by quenched fluorescent res...
In DepthDetails ArticlePubMed
TargetProcathepsin L(Homo sapiens (Human))
Astrazeneca
Curated by ChEMBL
LigandPNGBDBM50390398(CHEMBL2070949)
Affinity DataIC50: >1.00E+5nM. Assay description: Inhibition of human recombinant cathepsin L using Z-Phe-Arg-AMC as substrate preincubated for 30 mins measured after 1 hr by quenched fluorescent res...
In DepthDetails ArticlePubMed
TargetCathepsin S(Homo sapiens (Human))
Astrazeneca
Curated by ChEMBL
LigandPNGBDBM50390398(CHEMBL2070949)
Affinity DataIC50: >1.00E+4nM. Assay description: Inhibition of human recombinant cathepsin S using Z-Val-Val-Arg-AMC as substrate preincubated for 30 mins measured after 1 hr by quenched fluorescent...
In DepthDetails ArticlePubMed
TargetPotassium voltage-gated channel subfamily H member 2(Homo sapiens (Human))
Astrazeneca
Curated by ChEMBL
LigandPNGBDBM50390398(CHEMBL2070949)
Affinity DataIC50: >1.00E+5nM. Assay description: Inhibition of human ERG
In DepthDetails ArticlePubMed
TargetCathepsin B(Homo sapiens (Human))
Astrazeneca
Curated by ChEMBL
LigandPNGBDBM50390398(CHEMBL2070949)
Affinity DataIC50:  2.51E+4nM. Assay description: Inhibition of human recombinant cathepsin B using Z-Arg-Arg-AMC as substrate preincubated for 30 mins measured after 1 hr by quenched fluorescent res...
In DepthDetails ArticlePubMed
TargetCytochrome P450 2C9(Homo sapiens (Human))
Astrazeneca
Curated by ChEMBL
LigandPNGBDBM50390398(CHEMBL2070949)
Affinity DataIC50: >3.16E+4nM. Assay description: Inhibition of CYP2C9
In DepthDetails ArticlePubMed
TargetCytochrome P450 2C19(Homo sapiens (Human))
Astrazeneca
Curated by ChEMBL
LigandPNGBDBM50390398(CHEMBL2070949)
Affinity DataIC50: >3.16E+4nM. Assay description: Inhibition of CYP2C19
In DepthDetails ArticlePubMed
TargetCytochrome P450 2D6(Homo sapiens (Human))
Astrazeneca
Curated by ChEMBL
LigandPNGBDBM50390398(CHEMBL2070949)
Affinity DataIC50: >3.16E+4nM. Assay description: Inhibition of CYP2D6
In DepthDetails ArticlePubMed
TargetCytochrome P450 1A2(Homo sapiens (Human))
Astrazeneca
Curated by ChEMBL
LigandPNGBDBM50390398(CHEMBL2070949)
Affinity DataIC50: >3.16E+4nM. Assay description: Inhibition of CYP1A2
In DepthDetails ArticlePubMed
TargetCytochrome P450 3A4(Homo sapiens (Human))
Astrazeneca
Curated by ChEMBL
LigandPNGBDBM50390398(CHEMBL2070949)
Affinity DataIC50: >3.16E+4nM. Assay description: Inhibition of CYP3A4
In DepthDetails ArticlePubMed