BDBM50390407 CHEMBL2070946
SMILES O=C(NC1(CC1)C#N)[C@@H]1CCCC[C@H]1C(=O)N1CCN(CC1)c1ncc(s1)C#N
InChI Key InChIKey=OQOOOJVROUBAQY-HZPDHXFCSA-N
Data  2 IC50
  Tab Delimited (TSV)   2D SDfile   Computed 3D by Vconf -m prep SDfile
Find this compound or compounds like it in BindingDB:
Activity Spreadsheet -- Enzyme Inhibition Constant Data from BindingDB
Found 2 hits for monomerid = 50390407
TargetCathepsin K(Homo sapiens (Human))
Astrazeneca
Curated by ChEMBL
LigandPNGBDBM50390407(CHEMBL2070946)
Affinity DataIC50:  200nM. Assay description: Inhibition of human recombinant cathepsin K using Z-Phe-Arg-AMC as substrate preincubated for 30 mins measured after 1 hr by quenched fluorescent res...
In DepthDetails ArticlePubMed
TargetCathepsin B(Homo sapiens (Human))
Astrazeneca
Curated by ChEMBL
LigandPNGBDBM50390407(CHEMBL2070946)
Affinity DataIC50:  3.98E+3nM. Assay description: Inhibition of human recombinant cathepsin B using Z-Arg-Arg-AMC as substrate preincubated for 30 mins measured after 1 hr by quenched fluorescent res...
In DepthDetails ArticlePubMed