BDBM50390989 CHEMBL146554
SMILES CC(C)C(=O)C(O)=O
InChI Key InChIKey=QHKABHOOEWYVLI-UHFFFAOYSA-N
Data  1 KI
PDB links: 8 PDB IDs match this monomer.
  Tab Delimited (TSV)   2D SDfile   Computed 3D by Vconf -m prep SDfile
Find this compound or compounds like it in BindingDB:
Activity Spreadsheet -- Enzyme Inhibition Constant Data from BindingDB
Found 1 hit for monomerid = 50390989
TargetMonocarboxylate transporter 2(Rattus norvegicus)
Physiologisch-Chemisches Institut Der Eberhard-Karls-Universit£T T£Bingen
Curated by ChEMBL
LigandPNGBDBM50390989(CHEMBL146554)
Affinity DataKi:  3.00E+5nM. Assay description: TP_TRANSPORTER: inhibition of lactate uptake in Xenopus laevis oocytes
In DepthDetails ArticlePubMed