BDBM50391133 CHEMBL2087935
SMILES NS(=O)(=O)c1ccc(NN2C(SCC2=O)c2ccccc2)cc1
InChI Key InChIKey=LMWPQPVQIFNCPV-UHFFFAOYSA-N
Data  2 IC50
  Tab Delimited (TSV)   2D SDfile   Computed 3D by Vconf -m prep SDfile
Find this compound or compounds like it in BindingDB:
Activity Spreadsheet -- Enzyme Inhibition Constant Data from BindingDB
Found 2 hits for monomerid = 50391133
TargetProstaglandin G/H synthase 2(Homo sapiens (Human))
Hacettepe University
Curated by ChEMBL
LigandPNGBDBM50391133(CHEMBL2087935)
Affinity DataIC50:  7.82E+4nM. Assay description: Inhibition of human recombinant COX2 assessed as inhibition of PGF2alpha production from PGH2 by enzyme immunoassay
In DepthDetails ArticlePubMed
TargetProstaglandin G/H synthase 1(Ovis aries (Sheep))
Hacettepe University
Curated by ChEMBL
LigandPNGBDBM50391133(CHEMBL2087935)
Affinity DataIC50:  9.64E+4nM. Assay description: Inhibition of ovine COX1 assessed as inhibition of PGF2alpha production from PGH2 by enzyme immuno assay
In DepthDetails ArticlePubMed