BDBM50391152 CHEMBL2087980
SMILES Cc1cccc(n1)-c1nc(NCc2ccccc2C)sc1-c1ccc2ncnn2c1
InChI Key InChIKey=OXVQEZJDLGHTQA-UHFFFAOYSA-N
Data  2 IC50
  Tab Delimited (TSV)   2D SDfile   Computed 3D by Vconf -m prep SDfile
Find this compound or compounds like it in BindingDB:
Activity Spreadsheet -- Enzyme Inhibition Constant Data from BindingDB
Found 2 hits for monomerid = 50391152
TargetMitogen-activated protein kinase 14(Homo sapiens (Human))
Ewha Womans University
Curated by ChEMBL
LigandPNGBDBM50391152(CHEMBL2087980)
Affinity DataIC50:  16.9nM. Assay description: Inhibition of human recombinant GST-fused ALK5 expressed in Sf9 cells using casein as a substrate by radioisotopic protein kinase assay
In DepthDetails ArticlePubMed
TargetMitogen-activated protein kinase 14(Homo sapiens (Human))
Ewha Womans University
Curated by ChEMBL
LigandPNGBDBM50391152(CHEMBL2087980)
Affinity DataIC50: >1.00E+4nM. Assay description: Inhibition of human recombinant p38alpha expressed in Escherichia coli using ATF2 as a substrate by radioisotopic protein kinase assay
In DepthDetails ArticlePubMed