BDBM50391335 CHEMBL143197
SMILES CN1C2CC(CC1C1OC21)OC(=O)c1c[nH]c2ccccc12
InChI Key InChIKey=NVYPANNIKFKQTB-UHFFFAOYSA-N
Data  1 Kd
  Tab Delimited (TSV)   2D SDfile   Computed 3D by Vconf -m prep SDfile
Find this compound or compounds like it in BindingDB:
Activity Spreadsheet -- Enzyme Inhibition Constant Data from BindingDB
Found 1 hit for monomerid = 50391335
Target5-hydroxytryptamine receptor 3A/3B(Mus musculus (house mouse))
TBA
Curated by ChEMBL
LigandPNGBDBM50391335(CHEMBL143197)
Affinity DataKd:  0.631nM. Assay description: Antagonistic activity against Serotonin 5-hydroxytryptamine 3 receptor of isolated guinea pig ileum (GPI)
In DepthDetails Article