BDBM50391339 CHEMBL12373
SMILES CC(C)C[C@H](CO)C(=O)N[C@H](Cc1cnc[nH]1)C(=O)N[C@H](Cc1ccccc1)C(=O)NCC(C)(C)C
InChI Key InChIKey=YWWNWOIUUDYXKA-YMPZKCBVSA-N
Data  1 IC50
  Tab Delimited (TSV)   2D SDfile   Computed 3D by Vconf -m prep SDfile
Find this compound or compounds like it in BindingDB:
Activity Spreadsheet -- Enzyme Inhibition Constant Data from BindingDB
Found 1 hit for monomerid = 50391339
TargetRenin(Homo sapiens (Human))
TBA
Curated by ChEMBL
LigandPNGBDBM50391339(CHEMBL12373)
Affinity DataIC50:  8.00E+4nM. Assay description: Compound was evaluated for inhibitory activity against renin
In DepthDetails Article