BDBM50391503 CHEMBL2147310
SMILES COc1cnc(cn1)-c1c(OC)ccc(F)c1CCNC(=O)c1ccc(COCC(F)(F)F)nc1
InChI Key InChIKey=DBLGDVQGUGDNDJ-UHFFFAOYSA-N
Data  1 IC50
  Tab Delimited (TSV)   2D SDfile   Computed 3D by Vconf -m prep SDfile
Find this compound or compounds like it in BindingDB:
Activity Spreadsheet -- Enzyme Inhibition Constant Data from BindingDB
Found 1 hit for monomerid = 50391503
TargetSodium channel protein type 9 subunit alpha(Homo sapiens (Human))
Astrazeneca
Curated by ChEMBL
LigandPNGBDBM50391503(CHEMBL2147310)
Affinity DataIC50:  200nM. Assay description: Inhibition of human Nav1.7 expressed in HEK293 cells by whole cell voltage-clamp electrophysiology assay
In DepthDetails ArticlePubMed