BDBM50391519 CHEMBL2147352
SMILES NCc1c[nH]c(c1)C(O)=O
InChI Key InChIKey=BOKUKQQSEHNHTP-UHFFFAOYSA-N
Data  1 KI
  Tab Delimited (TSV)   2D SDfile   Computed 3D by Vconf -m prep SDfile
Find this compound or compounds like it in BindingDB:
Activity Spreadsheet -- Enzyme Inhibition Constant Data from BindingDB
Found 1 hit for monomerid = 50391519
Target4-aminobutyrate aminotransferase, mitochondrial(Sus scrofa)
Northwestern University
Curated by ChEMBL
LigandPNGBDBM50391519(CHEMBL2147352)
Affinity DataKi:  1.59E+6nM. Assay description: Competitive inhibition of pig GABA aminotransferase using alpha-ketoglutarate as substrate by SSADH-coupled assay
In DepthDetails ArticlePubMed