BDBM50391538 CHEMBL2147463
SMILES CCN(CC)c1ccccc1CNCCCCCCCCNc1c2CCCCc2nc2ccccc12
InChI Key InChIKey=PJRLIZPQYQHGHE-UHFFFAOYSA-N
Data  2 IC50
  Tab Delimited (TSV)   2D SDfile   Computed 3D by Vconf -m prep SDfile
Find this compound or compounds like it in BindingDB:
Activity Spreadsheet -- Enzyme Inhibition Constant Data from BindingDB
Found 2 hits for monomerid = 50391538
TargetCholinesterase(Equus caballus (Horse))
Sun Yat-Sen University
Curated by ChEMBL
LigandPNGBDBM50391538(CHEMBL2147463)
Affinity DataIC50:  2.82nM. Assay description: Inhibition of equine serum BuChE using butylthiocholine chloride as substrate preincubated for 15 mins by Ellman's method
In DepthDetails ArticlePubMed
TargetAcetylcholinesterase(Electrophorus electricus (Electric eel))
Sun Yat-Sen University
Curated by ChEMBL
LigandPNGBDBM50391538(CHEMBL2147463)
Affinity DataIC50:  1.36nM. Assay description: Inhibition of electric eel AChE using acetylthiocholine chloride as substrate preincubated for 15 mins by Ellman's method
In DepthDetails ArticlePubMed