BDBM50392129 CHEMBL2152750
SMILES CCCN(CCCCN1CCN(CC1)C(=O)c1cc2ccccc2[nH]1)C1CCc2nc(N)sc2C1
InChI Key InChIKey=HFGNKYGWNOCWPA-UHFFFAOYSA-N
Data  2 KI
  Tab Delimited (TSV)   2D SDfile   Computed 3D by Vconf -m prep SDfile
Find this compound or compounds like it in BindingDB:
Activity Spreadsheet -- Enzyme Inhibition Constant Data from BindingDB
Found 2 hits for monomerid = 50392129
TargetD(3) dopamine receptor(Rattus norvegicus (Rat))
Wayne State University
Curated by ChEMBL
LigandPNGBDBM50392129(CHEMBL2152750)
Affinity DataKi:  1.70nM. Assay description: Displacement of [3H]spiroperidol from rat cloned dopamine D3 receptor expressed in HEK293 cells
In DepthDetails ArticlePubMed
TargetD(2) dopamine receptor(Rattus norvegicus (rat))
Wayne State University
Curated by ChEMBL
LigandPNGBDBM50392129(CHEMBL2152750)
Affinity DataKi:  531nM. Assay description: Displacement of [3H]spiroperidol from rat cloned dopamine D2L receptor expressed in HEK293 cells
In DepthDetails ArticlePubMed