BDBM50392667 CHEMBL2153829
SMILES Cc1c(cc(-c2ccc(cc2)S(C)(=O)=O)n1-c1ccc(F)cc1)C(N)C(=O)OCCCO
InChI Key InChIKey=GCBUIHJFEOFNFQ-UHFFFAOYSA-N
Data  2 IC50
  Tab Delimited (TSV)   2D SDfile   Computed 3D by Vconf -m prep SDfile
Find this compound or compounds like it in BindingDB:
Activity Spreadsheet -- Enzyme Inhibition Constant Data from BindingDB
Found 2 hits for monomerid = 50392667
TargetProstaglandin G/H synthase 2(Mus musculus (Mouse))
Sapienza University Of Rome
Curated by ChEMBL
LigandPNGBDBM50392667(CHEMBL2153829)
Affinity DataIC50:  760nM. Assay description: Inhibition of COX2-mediated PGE2 production in LPS-induced mouse J774 cells by radioimmunoassay
In DepthDetails ArticlePubMed
TargetProstaglandin G/H synthase 1(Mus musculus)
Sapienza University Of Rome
Curated by ChEMBL
LigandPNGBDBM50392667(CHEMBL2153829)
Affinity DataIC50: >1.00E+4nM. Assay description: Inhibition of COX1-mediated PGE2 production in mouse J774 cells preincubated for 15 mins measured after 30 mins by radioimmunoassay
In DepthDetails ArticlePubMed