BDBM50392889 CHEMBL2152097
SMILES C=CC(=O)NC1CN(C1)S(=O)(=O)c1ccc(NC(=O)OCc2ccccc2)cc1
InChI Key InChIKey=VKWMOVSIMRQHLJ-UHFFFAOYSA-N
Data  1 IC50
  Tab Delimited (TSV)   2D SDfile   Computed 3D by Vconf -m prep SDfile
Find this compound or compounds like it in BindingDB:
Activity Spreadsheet -- Enzyme Inhibition Constant Data from BindingDB
Found 1 hit for monomerid = 50392889
TargetProtein-glutamine gamma-glutamyltransferase 2(Homo sapiens (Human))
TBA
Curated by ChEMBL
LigandPNGBDBM50392889(CHEMBL2152097)
Affinity DataIC50:  1.60E+3nM. Assay description: Inhibition of human TGM2
In DepthDetails ArticlePubMed