BDBM50392973 CHEMBL2152373
SMILES Clc1cccc(CNC(=O)C[C@@H]2C\C=C\CCC(=O)O[C@@H](CNC2=O)c2ccccc2)c1
InChI Key InChIKey=UQVOPKWUIIYHLT-BQIDRLATSA-N
Data  1 IC50
  Tab Delimited (TSV)   2D SDfile   Computed 3D by Vconf -m prep SDfile
Find this compound or compounds like it in BindingDB:
Activity Spreadsheet -- Enzyme Inhibition Constant Data from BindingDB
Found 1 hit for monomerid = 50392973
TargetSmoothened homolog(Mus musculus)
TBA
Curated by ChEMBL
LigandPNGBDBM50392973(CHEMBL2152373)
Affinity DataIC50:  5.00E+3nM. Assay description: Inhibition of Smo in mouse C3H10T1/2 cells assessed as inhibition of human Shh-induced cell differentiation after 48 hrs by alkaline phosphatase repo...
In DepthDetails ArticlePubMed