BDBM50393025 CHEMBL2152690::US9656959, Example 60
SMILES OC[C@H](NC(=O)CO)C(=O)Nc1cccc(n1)-c1ccc(Oc2ccc(F)cc2)cc1
InChI Key InChIKey=CEJYQWUEJRODQA-IBGZPJMESA-N
Data  2 KI  2 IC50
  Tab Delimited (TSV)   2D SDfile   Computed 3D by Vconf -m prep SDfile
Find this compound or compounds like it in BindingDB:
Activity Spreadsheet -- Enzyme Inhibition Constant Data from BindingDB
Found 4 hits for monomerid = 50393025
TargetSodium channel protein type 9 subunit alpha(Homo sapiens (Human))
TBA
Curated by ChEMBL
LigandPNGBDBM50393025(CHEMBL2152690 | US9656959, Example 60)
Affinity DataKi:  113nM. Assay description: Blockade of Nav1.7 by electrophysiological patch clamp assay
In DepthDetails ArticlePubMed
TargetSodium channel protein type 9 subunit alpha(Homo sapiens (Human))
TBA
Curated by ChEMBL
LigandPNGBDBM50393025(CHEMBL2152690 | US9656959, Example 60)
Affinity DataKi:  113nM. Assay description: In the alternative, the voltage clamp protocol to examine hNav1.7 currents was as follows. First, the standard current-voltage relationship was teste...
In DepthDetails US Patent
TargetSodium channel protein type 9 subunit alpha(Homo sapiens (Human))
TBA
Curated by ChEMBL
LigandPNGBDBM50393025(CHEMBL2152690 | US9656959, Example 60)
Affinity DataIC50:  460nM. Assay description: In vitro assays were performed in a recombinant cell line expressing cDNA encoding the alpha subunit (Nav1.7, SCN9a, PN1, NE) of human Nav1.7 (Access...
In DepthDetails US Patent
TargetSodium channel protein type 9 subunit alpha(Homo sapiens (Human))
TBA
Curated by ChEMBL
LigandPNGBDBM50393025(CHEMBL2152690 | US9656959, Example 60)
Affinity DataIC50:  460nM. Assay description: Blockade of Nav1.7 by FLIPR TETRA sodium dye assay in presence of KCl salt
In DepthDetails ArticlePubMed