BDBM50393151 CHEMBL2153589
SMILES Clc1cccc(c1)-c1ccc(cc1)-c1nnc(CCCc2ccc3cccnc3n2)s1
InChI Key InChIKey=QYSVUPPSENSKRI-UHFFFAOYSA-N
Data  1 IC50
  Tab Delimited (TSV)   2D SDfile   Computed 3D by Vconf -m prep SDfile
Find this compound or compounds like it in BindingDB:
Activity Spreadsheet -- Enzyme Inhibition Constant Data from BindingDB
Found 1 hit for monomerid = 50393151
TargetSuccinate receptor 1(Homo sapiens (Human))
Advinus Therapeutics
Curated by ChEMBL
LigandPNGBDBM50393151(CHEMBL2153589)
Affinity DataIC50:  3.00E+3nM. Assay description: Antagonist activity at human GPR91 receptor expressed in CHO-K1 cells co-expressing Galpha and Gqi5 G-protein assessed as inhibition of succinate-ind...
In DepthDetails ArticlePubMed