BDBM50393160 CHEMBL2153598
SMILES Fc1ccc(cc1OC(F)(F)F)-c1nnc(CCCCc2ccc3cccnc3n2)o1
InChI Key InChIKey=UAEWXICMVWVIMK-UHFFFAOYSA-N
Data  1 IC50
  Tab Delimited (TSV)   2D SDfile   Computed 3D by Vconf -m prep SDfile
Find this compound or compounds like it in BindingDB:
Activity Spreadsheet -- Enzyme Inhibition Constant Data from BindingDB
Found 1 hit for monomerid = 50393160
TargetSuccinate receptor 1(Homo sapiens (Human))
Advinus Therapeutics
Curated by ChEMBL
LigandPNGBDBM50393160(CHEMBL2153598)
Affinity DataIC50:  4.00E+3nM. Assay description: Antagonist activity at human GPR91 receptor expressed in CHO-K1 cells co-expressing Galpha and Gqi5 G-protein assessed as inhibition of succinate-ind...
In DepthDetails ArticlePubMed