BDBM50393173 CHEMBL2153625
SMILES Cn1c2nc3N(CCCn3c2c(=O)n(C)c1=O)C1CCCC1
InChI Key InChIKey=NARMXGYEFNCBFB-UHFFFAOYSA-N
Data  2 KI
  Tab Delimited (TSV)   2D SDfile   Computed 3D by Vconf -m prep SDfile
Find this compound or compounds like it in BindingDB:
Activity Spreadsheet -- Enzyme Inhibition Constant Data from BindingDB
Found 2 hits for monomerid = 50393173
TargetAdenosine receptor A2a(Rattus norvegicus (rat))
Jagiellonian University Medical College
Curated by ChEMBL
LigandPNGBDBM50393173(CHEMBL2153625)
Affinity DataKi:  1.00E+3nM. Assay description: Displacement of [3H]MSX-2 from adenosine A2A receptor in rat brain striatal membrane
In DepthDetails ArticlePubMed
TargetAdenosine receptor A1(Rattus norvegicus (rat))
Jagiellonian University Medical College
Curated by ChEMBL
LigandPNGBDBM50393173(CHEMBL2153625)
Affinity DataKi:  5.31E+3nM. Assay description: Displacement of [3H]CCPA from adenosine A1 receptor in rat brain cortical membrane
In DepthDetails ArticlePubMed