BDBM50393187 CHEMBL2153607
SMILES CC1CCC(CC1)N1CCCCn2c1nc1n(C)c(=O)n(C)c(=O)c21
InChI Key InChIKey=LFXRTFFVHPQKMN-UHFFFAOYSA-N
Data  2 KI
  Tab Delimited (TSV)   2D SDfile   Computed 3D by Vconf -m prep SDfile
Find this compound or compounds like it in BindingDB:
Activity Spreadsheet -- Enzyme Inhibition Constant Data from BindingDB
Found 2 hits for monomerid = 50393187
TargetAdenosine receptor A2a(Rattus norvegicus (rat))
Jagiellonian University Medical College
Curated by ChEMBL
LigandPNGBDBM50393187(CHEMBL2153607)
Affinity DataKi:  830nM. Assay description: Displacement of [3H]MSX-2 from adenosine A2A receptor in rat brain striatal membrane
In DepthDetails ArticlePubMed
TargetAdenosine receptor A1(Rattus norvegicus (rat))
Jagiellonian University Medical College
Curated by ChEMBL
LigandPNGBDBM50393187(CHEMBL2153607)
Affinity DataKi:  3.44E+3nM. Assay description: Displacement of [3H]CCPA from adenosine A1 receptor in rat brain cortical membrane
In DepthDetails ArticlePubMed