BDBM50393193 CHEMBL2153626
SMILES Cn1c2nc3N(CCCn3c2c(=O)n(C)c1=O)C1CCC1
InChI Key InChIKey=JWLHBUXUVJHRRR-UHFFFAOYSA-N
Data  5 KI
  Tab Delimited (TSV)   2D SDfile   Computed 3D by Vconf -m prep SDfile
Find this compound or compounds like it in BindingDB:
Activity Spreadsheet -- Enzyme Inhibition Constant Data from BindingDB
Found 5 hits for monomerid = 50393193
TargetAdenosine receptor A2a(Homo sapiens (Human))
Jagiellonian University Medical College
Curated by ChEMBL
LigandPNGBDBM50393193(CHEMBL2153626)
Affinity DataKi:  847nM. Assay description: Displacement of [3H]MSX-2 from human recombinant adenosine A2A receptor expressed in CHO cells
In DepthDetails ArticlePubMed
TargetAdenosine receptor A2a(Rattus norvegicus (rat))
Jagiellonian University Medical College
Curated by ChEMBL
LigandPNGBDBM50393193(CHEMBL2153626)
Affinity DataKi:  1.93E+3nM. Assay description: Displacement of [3H]MSX-2 from adenosine A2A receptor in rat brain striatal membrane
In DepthDetails ArticlePubMed
TargetAdenosine receptor A3(Homo sapiens (Human))
Jagiellonian University Medical College
Curated by ChEMBL
LigandPNGBDBM50393193(CHEMBL2153626)
Affinity DataKi: >1.00E+4nM. Assay description: Displacement of [3H]PSB-11 from human recombinant adenosine A3 receptor expressed in CHO cells
In DepthDetails ArticlePubMed
TargetAdenosine receptor A2b(Homo sapiens (Human))
Jagiellonian University Medical College
Curated by ChEMBL
LigandPNGBDBM50393193(CHEMBL2153626)
Affinity DataKi: >1.00E+4nM. Assay description: Displacement of [3H]PSB-603 from human recombinant adenosine A2B receptor expressed in CHO cells
In DepthDetails ArticlePubMed
TargetAdenosine receptor A1(Homo sapiens (Human))
Jagiellonian University Medical College
Curated by ChEMBL
LigandPNGBDBM50393193(CHEMBL2153626)
Affinity DataKi:  1.03E+4nM. Assay description: Displacement of [3H]CCPA from human recombinant adenosine A1 receptor expressed in CHO cells
In DepthDetails ArticlePubMed