BDBM50393363 CHEMBL2152255
SMILES Nc1ncc(cn1)-c1ccc(Cl)c(c1)S(=O)(=O)Nc1cccc(F)c1F
InChI Key InChIKey=AFVKBPLUPVLQSJ-UHFFFAOYSA-N
Data  4 IC50
  Tab Delimited (TSV)   2D SDfile   Computed 3D by Vconf -m prep SDfile
Find this compound or compounds like it in BindingDB:
Activity Spreadsheet -- Enzyme Inhibition Constant Data from BindingDB
Found 4 hits for monomerid = 50393363
LigandPNGBDBM50393363(CHEMBL2152255)
Affinity DataIC50:  60nM. Assay description: Inhibition of human PI3Kgamma expressed in sf9 cells assessed as amount of ATP consumed by luciferase-luciferin chemiluminescence assay
In DepthDetails ArticlePubMed
LigandPNGBDBM50393363(CHEMBL2152255)
Affinity DataIC50:  1.32E+3nM. Assay description: Inhibition of human PI3Kdelta expressed in sf9 cells coexpressing p85alpha assessed as amount of ATP consumed by luciferase-luciferin chemiluminescen...
In DepthDetails ArticlePubMed
LigandPNGBDBM50393363(CHEMBL2152255)
Affinity DataIC50:  2.64E+3nM. Assay description: Inhibition of human PI3Kbeta expressed in sf9 cells coexpressing p85alpha assessed as amount of ATP consumed by luciferase-luciferin chemiluminescenc...
In DepthDetails ArticlePubMed
LigandPNGBDBM50393363(CHEMBL2152255)
Affinity DataIC50:  1.66E+3nM. Assay description: Inhibition of human PI3Kalpha expressed in sf9 cells coexpressing p85alpha assessed as amount of ATP consumed by luciferase-luciferin chemiluminescen...
In DepthDetails ArticlePubMed