BDBM50393425 CHEMBL2159312
SMILES CCOc1ccccc1C(=O)NC1CCN(CCOc2cccc(NC(C)=O)c2)C1
InChI Key InChIKey=LQSFQBRLPOTWNI-UHFFFAOYSA-N
Data  1 KI
  Tab Delimited (TSV)   2D SDfile   Computed 3D by Vconf -m prep SDfile
Find this compound or compounds like it in BindingDB:
Activity Spreadsheet -- Enzyme Inhibition Constant Data from BindingDB
Found 1 hit for monomerid = 50393425
Target5-hydroxytryptamine receptor 7(Homo sapiens (Human))
TBA
Curated by ChEMBL
LigandPNGBDBM50393425(CHEMBL2159312)
Affinity DataKi:  3.37E+3nM. Assay description: Displacement of [3H]-5-CT from human 5-HT7b receptor expressed in HEK293 cells after 1 hr
In DepthDetails ArticlePubMed