BDBM50393621 CHEMBL2158514
SMILES COc1cc(ccc1Nc1ncc2ccc(-c3ncccc3OC)n2n1)C1CCN(CC(N)=O)CC1
InChI Key InChIKey=NFVSDGCDOWJLIG-UHFFFAOYSA-N
Data  2 IC50
  Tab Delimited (TSV)   2D SDfile   Computed 3D by Vconf -m prep SDfile
Find this compound or compounds like it in BindingDB:
Activity Spreadsheet -- Enzyme Inhibition Constant Data from BindingDB
Found 2 hits for monomerid = 50393621
TargetALK tyrosine kinase receptor(Homo sapiens (Human))
Cephalon
Curated by ChEMBL
LigandPNGBDBM50393621(CHEMBL2158514)
Affinity DataIC50:  1.06E+3nM. Assay description: Inhibition of GST-tagged human ALK cytoplasmic domain (1058-1620) expressed in Sf21 insect cells using GST-tagged human recombinant PLC-gamma/substra...
In DepthDetails ArticlePubMed
TargetInsulin receptor(Homo sapiens (Human))
Cephalon
Curated by ChEMBL
LigandPNGBDBM50393621(CHEMBL2158514)
Affinity DataIC50: >1.00E+4nM. Assay description: Inhibition of IR
In DepthDetails ArticlePubMed