BDBM50393646 CHEMBL2158695
SMILES CCCCCCCCCCCc1ccc(cc1)[C@H]1CC[C@@H](CC1)[N+](C)(C)CCC
InChI Key InChIKey=GRRMWFAKRZOXKU-QVYRIUEQSA-N
Data  2 KI
  Tab Delimited (TSV)   2D SDfile   Computed 3D by Vconf -m prep SDfile
Find this compound or compounds like it in BindingDB:
Activity Spreadsheet -- Enzyme Inhibition Constant Data from BindingDB
Found 2 hits for monomerid = 50393646
TargetSphingosine kinase 2(Homo sapiens (Human))
Virginia Tech
Curated by ChEMBL
LigandPNGBDBM50393646(CHEMBL2158695)
Affinity DataKi:  1.10E+4nM. Assay description: Inhibition of recombinant SphK2 expressed in baculovirus infected Sf9 cells using D-erythro-sphingosine as substrate and [32gammaP]ATP by scintillati...
In DepthDetails ArticlePubMed
TargetSphingosine kinase 1(Homo sapiens (Human))
Virginia Tech
Curated by ChEMBL
LigandPNGBDBM50393646(CHEMBL2158695)
Affinity DataKi:  1.50E+4nM. Assay description: Inhibition of recombinant SphK1 expressed in baculovirus infected Sf9 cells using D-erythro-sphingosine as substrate and [32gammaP]ATP by scintillati...
In DepthDetails ArticlePubMed