BDBM50393686 CHEMBL2158920
SMILES [O-][N+](=O)c1ccc(SC(=S)N2CCOCC2)c(c1)[N+]([O-])=O
InChI Key InChIKey=QGLLEFNIRFZWDC-UHFFFAOYSA-N
Data  2 IC50
  Tab Delimited (TSV)   2D SDfile   Computed 3D by Vconf -m prep SDfile
Find this compound or compounds like it in BindingDB:
Activity Spreadsheet -- Enzyme Inhibition Constant Data from BindingDB
Found 2 hits for monomerid = 50393686
TargetMonoglyceride lipase(Homo sapiens (Human))
Universit£
Curated by ChEMBL
LigandPNGBDBM50393686(CHEMBL2158920)
Affinity DataIC50:  4.27E+3nM. Assay description: Inhibition of human recombinant MAGL using [3H]-2-OG as substrate after 10 mins by liquid scintillation counter
In DepthDetails ArticlePubMed
TargetFatty-acid amide hydrolase 1(Homo sapiens (Human))
Universit£
Curated by ChEMBL
LigandPNGBDBM50393686(CHEMBL2158920)
Affinity DataIC50:  5.37E+4nM. Assay description: Inhibition of human recombinant FAAH assessed as conversion of [3H]AEA to [3H]ethanolamine after 10 mins by liquid scintillation counter
In DepthDetails ArticlePubMed