BDBM50393795 CHEMBL2159512
SMILES Clc1cc(Cl)cc(CNCCCNC(=O)Nc2ccccc2)c1
InChI Key InChIKey=FFIHIYODYIKHMJ-UHFFFAOYSA-N
Data  1 IC50
PDB links: 1 PDB ID matches this monomer.
  Tab Delimited (TSV)   2D SDfile   Computed 3D by Vconf -m prep SDfile
Find this compound or compounds like it in BindingDB:
Activity Spreadsheet -- Enzyme Inhibition Constant Data from BindingDB
Found 1 hit for monomerid = 50393795
TargetMethionine--tRNA ligase, cytoplasmic(Homo sapiens (Human))
University Of Washington
Curated by ChEMBL
LigandPNGBDBM50393795(CHEMBL2159512)
Affinity DataIC50: >1.00E+4nM. Assay description: Inhibition of human mitochondrial MetRS aminoacylation activity assessed as reduction in [3H]methionine incorporation into Escherichia coli tRNA pre-...
In DepthDetails ArticlePubMed