BDBM50393964 CHEMBL2158347
SMILES [O-][N+](=O)c1ccc(cc1)C(=O)Oc1coc(CSc2ncccn2)cc1=O
InChI Key InChIKey=UASIRTUMPRQVFY-UHFFFAOYSA-N
Data  3 IC50
  Tab Delimited (TSV)   2D SDfile   Computed 3D by Vconf -m prep SDfile
Find this compound or compounds like it in BindingDB:
Activity Spreadsheet -- Enzyme Inhibition Constant Data from BindingDB
Found 3 hits for monomerid = 50393964
TargetApelin receptor(Homo sapiens (Human))
Sanford-Burnham Medical Research Institute
Curated by ChEMBL
LigandPNGBDBM50393964(CHEMBL2158347)
Affinity DataIC50:  1.75E+3nM. Assay description: Antagonist activity at APJ receptor expressed in CHOK1 cells assessed as inhibition of apelin13-induced beta-arrestin recruitment after 90 mins by lu...
In DepthDetails ArticlePubMed
TargetType-1 angiotensin II receptor(Homo sapiens (Human))
Sanford-Burnham Medical Research Institute
Curated by ChEMBL
LigandPNGBDBM50393964(CHEMBL2158347)
Affinity DataIC50: >7.90E+4nM. Assay description: Inhibition of AT1 receptor
In DepthDetails ArticlePubMed
TargetApelin receptor(Homo sapiens (Human))
Sanford-Burnham Medical Research Institute
Curated by ChEMBL
LigandPNGBDBM50393964(CHEMBL2158347)
Affinity DataIC50:  700nM. Assay description: Antagonist activity at APJ receptor assessed as inhibition of apelin13-induced cAMP accumulation
In DepthDetails ArticlePubMed