BDBM50394357 CHEMBL2159795
SMILES [O-][N+](=O)c1ccc(cc1C(=O)Nc1ccccc1)N1CCN(CC1)C(=O)n1nnc2ccccc12
InChI Key InChIKey=ZKPWWIYOQKBVFK-UHFFFAOYSA-N
Data  2 IC50
  Tab Delimited (TSV)   2D SDfile   Computed 3D by Vconf -m prep SDfile
Find this compound or compounds like it in BindingDB:
Activity Spreadsheet -- Enzyme Inhibition Constant Data from BindingDB
Found 2 hits for monomerid = 50394357
TargetMonoglyceride lipase(Homo sapiens (Human))
Sapienza University Of Rome
Curated by ChEMBL
LigandPNGBDBM50394357(CHEMBL2159795)
Affinity DataIC50:  19nM. Assay description: Inhibition of human MAGL assessed as [3H]-2-OG hydrolysis preincubated for 30 mins before [3H]-2-OG addition measured after 10 mins by liquid scintil...
In DepthDetails ArticlePubMed
TargetFatty-acid amide hydrolase 1(Homo sapiens (Human))
Sapienza University Of Rome
Curated by ChEMBL
LigandPNGBDBM50394357(CHEMBL2159795)
Affinity DataIC50:  363nM. Assay description: Inhibition of human recombinant FAAH assessed as [3H]-AEA hydrolysis preincubated for 30 mins before [3H]-2-OG addition measured after 10 mins by liq...
In DepthDetails ArticlePubMed