BDBM50394482 CHEMBL2159867
SMILES OCCCCOc1ccccc1NC(=O)N[C@@H]1CCN(Cc2ccc3cc(F)ccc3c2)C1
InChI Key InChIKey=QXPNJBYJGHYSFV-HSZRJFAPSA-N
Data  1 IC50
  Tab Delimited (TSV)   2D SDfile   Computed 3D by Vconf -m prep SDfile
Find this compound or compounds like it in BindingDB:
Activity Spreadsheet -- Enzyme Inhibition Constant Data from BindingDB
Found 1 hit for monomerid = 50394482
TargetC-C chemokine receptor type 3(Homo sapiens (Human))
Toray Industries
Curated by ChEMBL
LigandPNGBDBM50394482(CHEMBL2159867)
Affinity DataIC50:  9.90nM. Assay description: Antagonist activity at CCR3 receptor
In DepthDetails ArticlePubMed